Target
P2X purinoceptor 7
Ligand
BDBM50533062
Substrate
Meas. Tech.
ChEMBL_1924278 (CHEMBL4427234)
IC50
3.4±n/a nM
Citation
 Rech, JCBhattacharya, ALetavic, MASavall, BM The evolution of P2X7 antagonists with a focus on CNS indications. Bioorg Med Chem Lett 26:3838-45 (2016)  
Target
Name:
P2X purinoceptor 7
Synonyms:
ATP receptor P2RX7_HUMAN P2X purinoceptor 7 (P2X7) P2Z receptor | Purinergic receptor
Type:
Protein
Mol. Mass.:
68602.85
Organism:
Homo sapiens (Human)
Description:
Q99572
Residue:
595
  
Inhibitor
Name:
BDBM50533062
Synonyms:
CHEMBL4573316
Type:
Small organic molecule
Emp. Form.:
C21H26ClN3O
Mol. Mass.:
371.904
SMILES:
Clc1ccc(cn1)C1(CNC(=O)C2CCCc3[nH]ccc23)CCCCC1
: