Target
P2X purinoceptor 7
Ligand
BDBM50533064
Substrate
Meas. Tech.
ChEMBL_1924281 (CHEMBL4427237)
IC50
<10.0±n/a nM
Citation
 Rech, JCBhattacharya, ALetavic, MASavall, BM The evolution of P2X7 antagonists with a focus on CNS indications. Bioorg Med Chem Lett 26:3838-45 (2016)  
Target
Name:
P2X purinoceptor 7
Synonyms:
ATP receptor P2RX7_HUMAN P2X purinoceptor 7 (P2X7) P2Z receptor | Purinergic receptor
Type:
Protein
Mol. Mass.:
68602.85
Organism:
Homo sapiens (Human)
Description:
Q99572
Residue:
595
  
Inhibitor
Name:
BDBM50533064
Synonyms:
CHEMBL4538740
Type:
Small organic molecule
Emp. Form.:
C22H27ClF2N4O2
Mol. Mass.:
452.925
SMILES:
CN(C)C(=O)CCNc1ccc2c(C(=O)NCC3CCC(F)(F)CC3)c(Cl)ccc2n1
: