Target
P2X purinoceptor 7
Ligand
BDBM50533066
Substrate
Meas. Tech.
ChEMBL_1924265 (CHEMBL4427221)
IC50
11±n/a nM
Citation
 Rech, JCBhattacharya, ALetavic, MASavall, BM The evolution of P2X7 antagonists with a focus on CNS indications. Bioorg Med Chem Lett 26:3838-45 (2016)  
Target
Name:
P2X purinoceptor 7
Synonyms:
ATP receptor P2RX7_HUMAN P2X purinoceptor 7 (P2X7) P2Z receptor | Purinergic receptor
Type:
Protein
Mol. Mass.:
68602.85
Organism:
Homo sapiens (Human)
Description:
Q99572
Residue:
595
  
Inhibitor
Name:
BDBM50533066
Synonyms:
CHEMBL4567755
Type:
Small organic molecule
Emp. Form.:
C23H22ClF3N4O
Mol. Mass.:
462.895
SMILES:
CC(C)(C)c1nnc2[C@H](N(CCn12)C(=O)c1cccc(c1Cl)C(F)(F)F)c1ccccc1
: