Target
P2X purinoceptor 7
Ligand
BDBM173295
Substrate
Meas. Tech.
ChEMBL_1924265 (CHEMBL4427221)
IC50
8.5±n/a nM
Citation
 Rech, JCBhattacharya, ALetavic, MASavall, BM The evolution of P2X7 antagonists with a focus on CNS indications. Bioorg Med Chem Lett 26:3838-45 (2016)  
Target
Name:
P2X purinoceptor 7
Synonyms:
ATP receptor P2RX7_HUMAN P2X purinoceptor 7 (P2X7) P2Z receptor | Purinergic receptor
Type:
Protein
Mol. Mass.:
68602.85
Organism:
Homo sapiens (Human)
Description:
Q99572
Residue:
595
  
Inhibitor
Name:
BDBM173295
Synonyms:
US10323032, Example 33 US9604982, Example 33
Type:
Small organic molecule
Emp. Form.:
C19H15ClF3N5O
Mol. Mass.:
421.804
SMILES:
Cc1nc2CN(CCc2c(n1)-c1ccn[nH]1)C(=O)c1cccc(c1Cl)C(F)(F)F
: