Target
P2X purinoceptor 7
Ligand
BDBM50533067
Substrate
Meas. Tech.
ChEMBL_1924266 (CHEMBL4427222)
IC50
17±n/a nM
Citation
 Rech, JCBhattacharya, ALetavic, MASavall, BM The evolution of P2X7 antagonists with a focus on CNS indications. Bioorg Med Chem Lett 26:3838-45 (2016)  
Target
Name:
P2X purinoceptor 7
Synonyms:
ATP receptor P2X purinoceptor 7 P2X purinoceptor 7 (P2X7) P2X7 rat P2rx7 | Purinergic receptor
Type:
Protein
Mol. Mass.:
68403.50
Organism:
Rattus norvegicus (Rat)
Description:
Q64663
Residue:
595
  
Inhibitor
Name:
BDBM50533067
Synonyms:
CHEMBL4546974
Type:
Small organic molecule
Emp. Form.:
C22H18ClF3N4O
Mol. Mass.:
446.853
SMILES:
FC(F)(F)c1cccc(C(=O)N2CCn3c(nnc3[C@H]2c2ccccc2)C2CC2)c1Cl
: