Target
P2X purinoceptor 7
Ligand
BDBM173694
Substrate
Meas. Tech.
ChEMBL_1924280 (CHEMBL4427236)
IC50
0.790000±n/a nM
Citation
 Rech, JCBhattacharya, ALetavic, MASavall, BM The evolution of P2X7 antagonists with a focus on CNS indications. Bioorg Med Chem Lett 26:3838-45 (2016)  
Target
Name:
P2X purinoceptor 7
Synonyms:
ATP receptor P2RX7_HUMAN P2X purinoceptor 7 (P2X7) P2Z receptor | Purinergic receptor
Type:
Protein
Mol. Mass.:
68602.85
Organism:
Homo sapiens (Human)
Description:
Q99572
Residue:
595
  
Inhibitor
Name:
BDBM173694
Synonyms:
US9102591, 2,3-dichloro-N-[2-(6-cyclopropyl-3-pyridyl)-3-[1-(difluoromethyl)cyclopropyl]propyl]benzamide | US9649308, 2,3-dichloro-N-[2-(6-cyclopropyl-3-pyridyl)-3-[1-(difluoromethyl)cyclopropyl]propyl]benzamide
Type:
Small organic molecule
Emp. Form.:
C22H22Cl2F2N2O
Mol. Mass.:
439.326
SMILES:
FC(F)C1(CC(CNC(=O)c2cccc(Cl)c2Cl)c2ccc(nc2)C2CC2)CC1
: