Target
P2X purinoceptor 7
Ligand
BDBM50533070
Substrate
Meas. Tech.
ChEMBL_1924278 (CHEMBL4427234)
IC50
3.9±n/a nM
Citation
 Rech, JCBhattacharya, ALetavic, MASavall, BM The evolution of P2X7 antagonists with a focus on CNS indications. Bioorg Med Chem Lett 26:3838-45 (2016)  
Target
Name:
P2X purinoceptor 7
Synonyms:
ATP receptor P2RX7_HUMAN P2X purinoceptor 7 (P2X7) P2Z receptor | Purinergic receptor
Type:
Protein
Mol. Mass.:
68602.85
Organism:
Homo sapiens (Human)
Description:
Q99572
Residue:
595
  
Inhibitor
Name:
BDBM50533070
Synonyms:
CHEMBL4515801
Type:
Small organic molecule
Emp. Form.:
C20H19ClF3N5O2
Mol. Mass.:
453.845
SMILES:
FC(F)(F)c1ncc(cn1)C(CNC(=O)c1c(Cl)ccc2[nH]ccc12)N1CCOCC1
: