Target
P2X purinoceptor 7
Ligand
BDBM173337
Substrate
Meas. Tech.
ChEMBL_1924265 (CHEMBL4427221)
IC50
11±n/a nM
Citation
 Rech, JCBhattacharya, ALetavic, MASavall, BM The evolution of P2X7 antagonists with a focus on CNS indications. Bioorg Med Chem Lett 26:3838-45 (2016)  
Target
Name:
P2X purinoceptor 7
Synonyms:
ATP receptor P2RX7_HUMAN P2X purinoceptor 7 (P2X7) P2Z receptor | Purinergic receptor
Type:
Protein
Mol. Mass.:
68602.85
Organism:
Homo sapiens (Human)
Description:
Q99572
Residue:
595
  
Inhibitor
Name:
BDBM173337
Synonyms:
US10323032, Example 58 US9604982, Example 58
Type:
Small organic molecule
Emp. Form.:
C20H17ClF3N5O
Mol. Mass.:
435.83
SMILES:
C[C@@H]1Cc2c(CN1C(=O)c1cccc(c1Cl)C(F)(F)F)nc(C)nc2-c1ccn[nH]1
: