Target
P2X purinoceptor 7
Ligand
BDBM173337
Substrate
Meas. Tech.
ChEMBL_1924266 (CHEMBL4427222)
IC50
10.0±n/a nM
Citation
 Rech, JCBhattacharya, ALetavic, MASavall, BM The evolution of P2X7 antagonists with a focus on CNS indications. Bioorg Med Chem Lett 26:3838-45 (2016)  
Target
Name:
P2X purinoceptor 7
Synonyms:
ATP receptor P2X purinoceptor 7 P2X purinoceptor 7 (P2X7) P2X7 rat P2rx7 | Purinergic receptor
Type:
Protein
Mol. Mass.:
68403.50
Organism:
Rattus norvegicus (Rat)
Description:
Q64663
Residue:
595
  
Inhibitor
Name:
BDBM173337
Synonyms:
US10323032, Example 58 US9604982, Example 58
Type:
Small organic molecule
Emp. Form.:
C20H17ClF3N5O
Mol. Mass.:
435.83
SMILES:
C[C@@H]1Cc2c(CN1C(=O)c1cccc(c1Cl)C(F)(F)F)nc(C)nc2-c1ccn[nH]1
: