Target
P2X purinoceptor 7
Ligand
BDBM50533069
Substrate
Meas. Tech.
ChEMBL_1924265 (CHEMBL4427221)
IC50
8.7±n/a nM
Citation
 Rech, JCBhattacharya, ALetavic, MASavall, BM The evolution of P2X7 antagonists with a focus on CNS indications. Bioorg Med Chem Lett 26:3838-45 (2016)  
Target
Name:
P2X purinoceptor 7
Synonyms:
ATP receptor P2RX7_HUMAN P2X purinoceptor 7 (P2X7) P2Z receptor | Purinergic receptor
Type:
Protein
Mol. Mass.:
68602.85
Organism:
Homo sapiens (Human)
Description:
Q99572
Residue:
595
  
Inhibitor
Name:
BDBM50533069
Synonyms:
CHEMBL4077415
Type:
Small organic molecule
Emp. Form.:
C20H13ClF6N4O
Mol. Mass.:
474.787
SMILES:
FC(F)(F)c1nnc2[C@H](N(CCn12)C(=O)c1cccc(c1Cl)C(F)(F)F)c1ccccc1
: