Target
P2X purinoceptor 7
Ligand
BDBM267176
Substrate
Meas. Tech.
ChEMBL_1924279 (CHEMBL4427235)
IC50
18±n/a nM
Citation
 Rech, JCBhattacharya, ALetavic, MASavall, BM The evolution of P2X7 antagonists with a focus on CNS indications. Bioorg Med Chem Lett 26:3838-45 (2016)  
Target
Name:
P2X purinoceptor 7
Synonyms:
ATP receptor P2RX7_HUMAN P2X purinoceptor 7 (P2X7) P2Z receptor | Purinergic receptor
Type:
Protein
Mol. Mass.:
68602.85
Organism:
Homo sapiens (Human)
Description:
Q99572
Residue:
595
  
Inhibitor
Name:
BDBM267176
Synonyms:
N-[2-(4,4-difluoropiperidin-1-yl)-2-(1,3-oxazol-5-yl)ethyl]-2,6-dimethylbenzamide US9718812, 46
Type:
Small organic molecule
Emp. Form.:
C19H23F2N3O2
Mol. Mass.:
363.4016
SMILES:
Cc1cccc(C)c1C(=O)NCC(N1CCC(F)(F)CC1)c1cnco1
: