Target
P2X purinoceptor 7
Ligand
BDBM241720
Substrate
Meas. Tech.
ChEMBL_1924278 (CHEMBL4427234)
IC50
1.3±n/a nM
Citation
 Rech, JCBhattacharya, ALetavic, MASavall, BM The evolution of P2X7 antagonists with a focus on CNS indications. Bioorg Med Chem Lett 26:3838-45 (2016)  
Target
Name:
P2X purinoceptor 7
Synonyms:
ATP receptor P2RX7_HUMAN P2X purinoceptor 7 (P2X7) P2Z receptor | Purinergic receptor
Type:
Protein
Mol. Mass.:
68602.85
Organism:
Homo sapiens (Human)
Description:
Q99572
Residue:
595
  
Inhibitor
Name:
BDBM241720
Synonyms:
US9409917, 17 | US9409917, 18
Type:
Small organic molecule
Emp. Form.:
C17H16Cl2N2O2
Mol. Mass.:
351.227
SMILES:
Cc1cc(Cl)cc(Cl)c1CNC(=O)C1CCOc2ncccc12
: