Target
E3 ubiquitin-protein ligase XIAP
Ligand
BDBM50535123
Substrate
Meas. Tech.
ChEMBL_1929902 (CHEMBL4433078)
IC50
1090±n/a nM
Citation
 Manzoni, LGornati, DManzotti, MCairati, SBossi, AArosio, DLecis, DSeneci, P Dual action Smac mimetics-zinc chelators as pro-apoptotic antitumoral agents. Bioorg Med Chem Lett 26:4613-4619 (2016)  
Target
Name:
E3 ubiquitin-protein ligase XIAP
Synonyms:
API3 E3 ubiquitin-protein ligase XIAP Inhibitor of apoptosis protein 3 X-linked inhibitor of apoptosis XIAP | XIAP_HUMAN
Type:
Protein
Mol. Mass.:
56685.27
Organism:
Homo sapiens (Human)
Description:
P98170
Residue:
497
  
Inhibitor
Name:
BDBM50535123
Synonyms:
CHEMBL4552544
Type:
Small organic molecule
Emp. Form.:
C42H51N7O6
Mol. Mass.:
749.8976
SMILES:
[H][C@]12CC[C@H](N1C(=O)[C@@H](NC(=O)[C@H](CC)NC)[C@@H](CCNC(=O)c1ccccc1)CC2)C(=O)N[C@H](C(=O)N\N=C\c1cccc(CC=C)c1O)c1ccccc1
: