Target
Cytochrome P450 4B1
Ligand
BDBM50536234
Substrate
Meas. Tech.
ChEMBL_1933256 (CHEMBL4478908)
IC50
>40000±n/a nM
Citation
 Court, JJPoisson, CArdzinski, ABilimoria, DChan, LChandupatla, KChauret, NCollier, PNDas, SKDenis, FDorsch, WIyer, GLauffer, DL'Heureux, LLi, PLuisi, BSMani, NNanthakumar, SNicolas, ORao, BGRonkin, SSelliah, SShawgo, RSTang, QWaal, NDYannopoulos, CGGreen, J Discovery of Novel Thiophene-Based, Thumb Pocket 2 Allosteric Inhibitors of the Hepatitis C NS5B Polymerase with Improved Potency and Physicochemical Profiles. J Med Chem 59:6293-302 (2016)  
Target
Name:
Cytochrome P450 4B1
Synonyms:
1.14.14.1 CYP4B1 Cytochrome P450 4B1 | Cytochrome P450-HP
Type:
PROTEIN
Mol. Mass.:
59005.59
Organism:
Homo sapiens
Description:
ChEMBL_119703
Residue:
511
  
Inhibitor
Name:
BDBM50536234
Synonyms:
CHEMBL4580214
Type:
Small organic molecule
Emp. Form.:
C25H34N2O5S
Mol. Mass.:
474.613
SMILES:
C[C@H]1CC[C@@H](CC1)C(=O)N(CC(=O)N1CCOCC1)c1cc(sc1C(O)=O)C#CC(C)(C)C
: