Target
Nonstructural protein 5A
Ligand
BDBM50536247
Substrate
Meas. Tech.
ChEMBL_1933142 (CHEMBL4478794)
EC50
60±n/a nM
Citation
 Court, JJPoisson, CArdzinski, ABilimoria, DChan, LChandupatla, KChauret, NCollier, PNDas, SKDenis, FDorsch, WIyer, GLauffer, DL'Heureux, LLi, PLuisi, BSMani, NNanthakumar, SNicolas, ORao, BGRonkin, SSelliah, SShawgo, RSTang, QWaal, NDYannopoulos, CGGreen, J Discovery of Novel Thiophene-Based, Thumb Pocket 2 Allosteric Inhibitors of the Hepatitis C NS5B Polymerase with Improved Potency and Physicochemical Profiles. J Med Chem 59:6293-302 (2016)  
Target
Name:
Nonstructural protein 5A
Synonyms:
NS5A | Nonstructural protein 5A
Type:
PROTEIN
Mol. Mass.:
48587.20
Organism:
Hepatitis C virus
Description:
ChEMBL_108438
Residue:
447
  
Inhibitor
Name:
BDBM50536247
Synonyms:
CHEMBL4521916
Type:
Small organic molecule
Emp. Form.:
C24H34N2O5S
Mol. Mass.:
462.602
SMILES:
C[C@H]1CC[C@@H](CC1)C(=O)N([C@@H](CO)C(=O)N(C)C)c1cc(sc1C(O)=O)C#CC(C)(C)C
: