Target
Nonstructural protein 5A
Ligand
BDBM50536242
Substrate
Meas. Tech.
ChEMBL_1933145 (CHEMBL4478797)
EC50
35±n/a nM
Citation
 Court, JJPoisson, CArdzinski, ABilimoria, DChan, LChandupatla, KChauret, NCollier, PNDas, SKDenis, FDorsch, WIyer, GLauffer, DL'Heureux, LLi, PLuisi, BSMani, NNanthakumar, SNicolas, ORao, BGRonkin, SSelliah, SShawgo, RSTang, QWaal, NDYannopoulos, CGGreen, J Discovery of Novel Thiophene-Based, Thumb Pocket 2 Allosteric Inhibitors of the Hepatitis C NS5B Polymerase with Improved Potency and Physicochemical Profiles. J Med Chem 59:6293-302 (2016)  
Target
Name:
Nonstructural protein 5A
Synonyms:
NS5A | Nonstructural protein 5A
Type:
PROTEIN
Mol. Mass.:
48587.20
Organism:
Hepatitis C virus
Description:
ChEMBL_108438
Residue:
447
  
Inhibitor
Name:
BDBM50536242
Synonyms:
CHEMBL4579069
Type:
Small organic molecule
Emp. Form.:
C23H32N2O4S
Mol. Mass.:
432.576
SMILES:
C[C@H]1CC[C@@H](CC1)C(=O)N(CC(=O)N(C)C)c1cc(sc1C(O)=O)C#CC(C)(C)C
: