Target
Nonstructural protein 5A
Ligand
BDBM50536252
Substrate
Meas. Tech.
ChEMBL_1933142 (CHEMBL4478794)
EC50
51±n/a nM
Citation
 Court, JJPoisson, CArdzinski, ABilimoria, DChan, LChandupatla, KChauret, NCollier, PNDas, SKDenis, FDorsch, WIyer, GLauffer, DL'Heureux, LLi, PLuisi, BSMani, NNanthakumar, SNicolas, ORao, BGRonkin, SSelliah, SShawgo, RSTang, QWaal, NDYannopoulos, CGGreen, J Discovery of Novel Thiophene-Based, Thumb Pocket 2 Allosteric Inhibitors of the Hepatitis C NS5B Polymerase with Improved Potency and Physicochemical Profiles. J Med Chem 59:6293-302 (2016)  
Target
Name:
Nonstructural protein 5A
Synonyms:
NS5A | Nonstructural protein 5A
Type:
PROTEIN
Mol. Mass.:
48587.20
Organism:
Hepatitis C virus
Description:
ChEMBL_108438
Residue:
447
  
Inhibitor
Name:
BDBM50536252
Synonyms:
CHEMBL4519311
Type:
Small organic molecule
Emp. Form.:
C26H38N2O4S
Mol. Mass.:
474.656
SMILES:
CC(C)[C@H](N(C(=O)[C@H]1CC[C@H](C)CC1)c1cc(sc1C(O)=O)C#CC(C)(C)C)C(=O)N(C)C
: