Target
Gastrin/cholecystokinin type B receptor
Ligand
BDBM50092408
Substrate
Meas. Tech.
ChEMBL_48439 (CHEMBL660367)
EC50
0.56±n/a nM
Citation
 Bellier, BMillion, MEDaNascimento, SMeudal, HKellou, SMaigret, BGarbay, C Replacement of glycine with dicarbonyl and related moieties in analogues of the C-terminal pentapeptide of cholecystokinin: CCK(2) agonists displaying a novel binding mode. J Med Chem 43:3614-23 (2000)  
Target
Name:
Gastrin/cholecystokinin type B receptor
Synonyms:
Cckbr Cholecystokinin B receptor GASR_RAT | Gastrin/cholecystokinin type B receptor
Type:
Enzyme Catalytic Domain
Mol. Mass.:
48980.43
Organism:
RAT
Description:
Cholecystokinin A CCKBR RAT::P30553
Residue:
452
  
Inhibitor
Name:
BDBM50092408
Synonyms:
CHEMBL120150 | N-(1-Carbamoyl-2-phenyl-ethyl)-3-(2-{[3-(1H-indol-3-yl)-2-(2-sulfo-acetylamino)-propionyl]-methyl-amino}-hexanoylamino)-succinamic acid
Type:
Small organic molecule
Emp. Form.:
C33H42N6O10S
Mol. Mass.:
714.786
SMILES:
CCCC[C@H](N(C)C(=O)[C@H](Cc1c[nH]c2ccccc12)NC(=O)CS(O)(=O)=O)C(=O)N[C@@H](CC(O)=O)C(=O)N[C@@H](Cc1ccccc1)C(N)=O
: