Target
Delta-type opioid receptor
Ligand
BDBM50092671
Substrate
Meas. Tech.
ChEMBL_145322 (CHEMBL750410)
IC50
25±n/a nM
Citation
 Plobeck, NDelorme, DWei, ZYYang, HZhou, FSchwarz, PGawell, LGagnon, HPelcman, BSchmidt, RYue, SYWalpole, CBrown, WZhou, ELabarre, MPayza, KSt-Onge, SKamassah, AMorin, PEProjean, DDucharme, JRoberts, E New diarylmethylpiperazines as potent and selective nonpeptidic delta opioid receptor agonists with increased In vitro metabolic stability. J Med Chem 43:3878-94 (2000)  
Target
Name:
Delta-type opioid receptor
Synonyms:
D-OR-1 Delta opioid receptor OPIATE Delta OPRD1 OPRK1 | opioid receptor, delta 1
Type:
G Protein-Coupled Receptor (GPCR)
Mol. Mass.:
40382.98
Organism:
Homo sapiens (Human)
Description:
Competition binding assays were carried out using membrane preparations from transfected HN9.10 cells that constitutively expressed the delta opioid receptor.
Residue:
372
  
Inhibitor
Name:
BDBM50092671
Synonyms:
CHEMBL125742 | N,N-Diethyl-4-[(3-methoxy-phenyl)-piperazin-1-yl-methyl]-benzamide
Type:
Small organic molecule
Emp. Form.:
C23H31N3O2
Mol. Mass.:
381.5111
SMILES:
CCN(CC)C(=O)c1ccc(cc1)C(N1CCNCC1)c1cccc(OC)c1
: