Target
Substance-K receptor
Ligand
BDBM50093123
Substrate
Meas. Tech.
ChEBML_209041
Ki
409±n/a nM
Citation
 Ting, PCLee, JFAnthes, JCShih, NYPiwinski, JJ Synthesis and NK1/NK2 receptor activity of substituted-4(Z)-(methoxyimino)pentyl-1-piperazines. Bioorg Med Chem Lett 10:2333-5 (2001)  
Target
Name:
Substance-K receptor
Synonyms:
NK-2 receptor NK2R NKNAR Neurokinin A receptor Neurokinin-2 (NK-2) SKR TACR2 Tachykinin receptor 2 (NK2) | hnk-3
Type:
Protein
Mol. Mass.:
44455.78
Organism:
Homo sapiens (Human)
Description:
P21452
Residue:
398
  
Inhibitor
Name:
BDBM50093123
Synonyms:
1-[2-(4-{5-(3,5-Bis-trifluoromethyl-benzyloxy)-3-(3,4-dichloro-phenyl)-4-[(Z)-methoxyimino]-pentyl}-piperazin-1-yl)-acetyl]-piperidine-4-carboxylic acid ethyl ester | CHEMBL41068
Type:
Small organic molecule
Emp. Form.:
C35H42Cl2F6N4O5
Mol. Mass.:
783.628
SMILES:
CCOC(=O)C1CCN(CC1)C(=O)CN1CCN(CCC(\C(COCc2cc(cc(c2)C(F)(F)F)C(F)(F)F)=N\OC)c2ccc(Cl)c(Cl)c2)CC1
: