Target
Muscarinic acetylcholine receptor M2
Ligand
BDBM50004665
Substrate
Meas. Tech.
ChEMBL_1972562 (CHEMBL4605380)
Ki
851±n/a nM
Citation
 She, XPegoli, AGruber, CGWifling, DCarpenter, JHübner, HChen, MWan, JBernhardt, GGmeiner, PHolliday, NDKeller, M Red-Emitting Dibenzodiazepinone Derivatives as Fluorescent Dualsteric Probes for the Muscarinic Acetylcholine M J Med Chem 63:4133-4154 (2020)  
Target
Name:
Muscarinic acetylcholine receptor M2
Synonyms:
ACM2_HUMAN Cholinergic, muscarinic M2 Muscarinic acetylcholine receptor M2 and M5 | RecName: Full=Muscarinic acetylcholine receptor M2
Type:
GPCR
Mol. Mass.:
51730.61
Organism:
Homo sapiens (Human)
Description:
P08172
Residue:
466
  
Inhibitor
Name:
BDBM50004665
Synonyms:
(oxotremorine)1-(4-Pyrrolidin-1-yl-but-2-ynyl)-pyrrolidin-2-one 1-(4-Pyrrolidin-1-yl-but-2-ynyl)-pyrrolidin-2-one (oxotremorphine) 1-[4-(2-oxo-pyrrolidin-1-yl)-but-2-ynyl]-pyrrolidinium Oxotremorine cid_4630
Type:
Small organic molecule
Emp. Form.:
C12H18N2O
Mol. Mass.:
206.2841
SMILES:
O=C1CCCN1CC#CCN1CCCC1
: