Target
Solute carrier family 2, facilitated glucose transporter member 1
Ligand
BDBM453265
Substrate
Meas. Tech.
ChEMBL_1972718 (CHEMBL4605536)
IC50
36±n/a nM
Citation
 Liu, KGKim, JIOlszewski, KBarsotti, AMMorris, KLamarque, CYu, XGaffney, JFeng, XJPatel, JPPoyurovsky, MV Discovery and Optimization of Glucose Uptake Inhibitors. J Med Chem 63:5201-5211 (2020)  
Target
Name:
Solute carrier family 2, facilitated glucose transporter member 1
Synonyms:
GLUT-1 GTR1_HUMAN Glucose transporter HepG2 glucose transporter | SLC2A1
Type:
Protein
Mol. Mass.:
54091.71
Organism:
Homo sapiens (Human)
Description:
Residue:
492
  
Inhibitor
Name:
BDBM453265
Synonyms:
2-(3-(4-((4-(1H-pyrazol-4-yl)phenyl)amino)-7,8-dihydro-5H-pyrano[4,3-d]pyrimidin-2-yl)phenoxy)-N-(tert-butyl)acetamide | US10729691, Example 50
Type:
Small organic molecule
Emp. Form.:
C28H30N6O3
Mol. Mass.:
498.5762
SMILES:
CC(C)(C)NC(=O)COc1cccc(c1)-c1nc2CCOCc2c(Nc2ccc(cc2)-c2cn[nH]c2)n1
: