Target
Solute carrier family 2, facilitated glucose transporter member 1
Ligand
BDBM50514308
Substrate
Meas. Tech.
ChEMBL_1972718 (CHEMBL4605536)
IC50
50±n/a nM
Citation
 Liu, KGKim, JIOlszewski, KBarsotti, AMMorris, KLamarque, CYu, XGaffney, JFeng, XJPatel, JPPoyurovsky, MV Discovery and Optimization of Glucose Uptake Inhibitors. J Med Chem 63:5201-5211 (2020)  
Target
Name:
Solute carrier family 2, facilitated glucose transporter member 1
Synonyms:
GLUT-1 GTR1_HUMAN Glucose transporter HepG2 glucose transporter | SLC2A1
Type:
Protein
Mol. Mass.:
54091.71
Organism:
Homo sapiens (Human)
Description:
Residue:
492
  
Inhibitor
Name:
BDBM50514308
Synonyms:
CHEMBL4448899
Type:
Small organic molecule
Emp. Form.:
C24H16F4N6O2
Mol. Mass.:
496.4165
SMILES:
Cc1c(NC(=O)c2cc(nc3cc(F)ccc23)C(N)=O)c(nn1Cc1ccc(cc1)C#N)C(F)(F)F
: