Target
Histamine H3 receptor
Ligand
BDBM50214615
Substrate
Meas. Tech.
ChEMBL_1973781 (CHEMBL4606599)
Ki
0.501187±n/a nM
Citation
 Bartole, EGrätz, LLittmann, TWifling, DSeibel, UBuschauer, ABernhardt, G UR-DEBa242: A Py-5-Labeled Fluorescent Multipurpose Probe for Investigations on the Histamine H J Med Chem 63:5297-5311 (2020)  
Target
Name:
Histamine H3 receptor
Synonyms:
G-protein coupled receptor 97 HH3R HRH3 Histamine H3 receptor (H3) Histamine receptor (H3 and H4)
Type:
G Protein-Coupled Receptor (GPCR)
Mol. Mass.:
48691.47
Organism:
Homo sapiens (Human)
Description:
Binding assays were using CHO cells stably expressing hH3R receptors.
Residue:
445
  
Inhibitor
Name:
BDBM50214615
Synonyms:
CHEBI:64177 | Clobenpropit
Type:
Small organic molecule
Emp. Form.:
C14H17ClN4S
Mol. Mass.:
308.83
SMILES:
Clc1ccc(CNC(=N)SCCCc2c[nH]cn2)cc1
: