Target
Serine protease 1
Ligand
BDBM50096625
Substrate
Meas. Tech.
ChEBML_212852
Ki
>400±n/a nM
Citation
 Bachand, BTarazi, MSt-Denis, YEdmunds, JJWinocour, PDLeblond, LSiddiqui, MA Potent and selective bicyclic lactam inhibitors of thrombin. Part 4: transition state inhibitors. Bioorg Med Chem Lett 11:287-90 (2001)  
Target
Name:
Serine protease 1
Synonyms:
Alpha-trypsin chain 1 Beta-trypsin PRSS1 TRP1 TRY1_HUMAN Thrombin & trypsin Trypsin I | Trypsin-1
Type:
Enzyme
Mol. Mass.:
26557.80
Organism:
Homo sapiens (Human)
Description:
P07477
Residue:
247
  
Inhibitor
Name:
BDBM50096625
Synonyms:
(5-{2-(4-Amino-cyclohexyl)-2-[((6S,8aS)-4-oxo-2-phenylmethanesulfonyl-octahydro-pyrrolo[1,2-a]pyrazine-6-carbonyl)-amino]-acetyl}-tetrazol-1-yl)-acetic acid | CHEMBL3084835
Type:
Small organic molecule
Emp. Form.:
C26H34N8O7S
Mol. Mass.:
602.663
SMILES:
[H][C@@]12CC[C@H](N1C(=O)CN(C2)S(=O)(=O)Cc1ccccc1)C(=O)NC([C@H]1CC[C@H](N)CC1)C(=O)c1nnnn1CC(O)=O
: