Target
Prothrombin
Ligand
BDBM50098211
Substrate
Meas. Tech.
ChEMBL_209071 (CHEMBL809537)
IC50
900±n/a nM
Citation
 Zhang, HCDerian, CKAndrade-Gordon, PHoekstra, WJMcComsey, DFWhite, KBPoulter, BLAddo, MFCheung, WMDamiano, BPOksenberg, DReynolds, EEPandey, AScarborough, RMMaryanoff, BE Discovery and optimization of a novel series of thrombin receptor (par-1) antagonists: potent, selective peptide mimetics based on indole and indazole templates. J Med Chem 44:1021-4 (2001)  
Target
Name:
Prothrombin
Synonyms:
Activation peptide fragment 1 Coagulation factor II Prothrombin precursor Thrombin heavy chain | Thrombin light chain
Type:
Protein
Mol. Mass.:
70029.57
Organism:
Homo sapiens (Human)
Description:
P00734
Residue:
622
  
Inhibitor
Name:
BDBM50098211
Synonyms:
(S)-2-[(S)-2-{3-[1-(2,6-Dichloro-benzyl)-3-pyrrolidin-1-ylmethyl-1H-indol-6-yl]-ureido}-3-(4-methoxy-phenyl)-propionylamino]-5-guanidino-pentanoic acid benzylamide 2-[2-{3-[1-(2,6-Dichloro-benzyl)-3-pyrrolidin-1-ylmethyl-1H-indol-6-yl]-ureido}-3-(4-methoxy-phenyl)-propionylamino]-5-guanidino-pentanoic acid benzylamide RWJ-54003
Type:
Small organic molecule
Emp. Form.:
C44H51Cl2N9O4
Mol. Mass.:
840.84
SMILES:
[#6]-[#8]-c1ccc(-[#6]-[#6@H](-[#7]-[#6](=O)-[#7]-c2ccc3c(-[#6]-[#7]-4-[#6]-[#6]-[#6]-[#6]-4)cn(-[#6]-c4c(Cl)cccc4Cl)c3c2)-[#6](=O)-[#7]-[#6@@H](-[#6]-[#6]-[#6]\[#7]=[#6](\[#7])-[#7])-[#6](=O)-[#7]-[#6]-c2ccccc2)cc1
: