Target
Toll-like receptor 8
Ligand
BDBM50543161
Substrate
Meas. Tech.
ChEMBL_1988675 (CHEMBL4622222)
IC50
280±n/a nM
Citation
 Knoepfel, TNimsgern, PJacquier, SBourrel, MVangrevelinghe, EGlatthar, RBehnke, DAlper, PBMichellys, PYDeane, JJunt, TZipfel, GLimonta, SHawtin, SAndre, CBoulay, TLoetscher, PFaller, MBlank, JFeifel, RBetschart, C Target-Based Identification and Optimization of 5-Indazol-5-yl Pyridones as Toll-like Receptor 7 and 8 Antagonists Using a Biochemical TLR8 Antagonist Competition Assay. J Med Chem 63:8276-8295 (2020)  
Target
Name:
Toll-like receptor 8
Synonyms:
CD_antigen: CD288 TLR8_HUMAN | TRL8
Type:
Enzyme
Mol. Mass.:
119828.77
Organism:
Homo sapiens (Human)
Description:
Q9NR97
Residue:
1041
  
Inhibitor
Name:
BDBM50543161
Synonyms:
CHEMBL4647559
Type:
Small organic molecule
Emp. Form.:
C19H18F4N4O
Mol. Mass.:
394.366
SMILES:
Cn1c(F)c(ccc1=O)-c1cc(c2nn(cc2c1)C1CCNCC1)C(F)(F)F
: