Target
5-hydroxytryptamine receptor 2A
Ligand
BDBM50075360
Substrate
Meas. Tech.
ChEBML_2294
Ki
>10000±n/a nM
Citation
 Huang, YKegeles, LSBae, SHwang, DRoth, BLSavage, JELaruelle, M Synthesis of potent and selective dopamine D(4) antagonists as candidate radioligands. Bioorg Med Chem Lett 11:1375-7 (2001)  
Target
Name:
5-hydroxytryptamine receptor 2A
Synonyms:
5-HT-2 5-HT2A 5-hydroxytryptamine receptor 2A (5HT-2A) 5HT2A_HUMAN HTR2A | Serotonin receptor 2A
Type:
undefined
Mol. Mass.:
52607.65
Organism:
Homo sapiens (Human)
Description:
P28223
Residue:
471
  
Inhibitor
Name:
BDBM50075360
Synonyms:
3-[4-(4-Methoxy-phenyl)-piperazin-1-ylmethyl]-1H-pyrrolo[2,3-b]pyridine | CHEMBL28607
Type:
Small organic molecule
Emp. Form.:
C19H22N4O
Mol. Mass.:
322.4042
SMILES:
COc1ccc(cc1)N1CCN(Cc2c[nH]c3ncccc23)CC1
: