Target
Gamma-aminobutyric acid receptor subunit alpha-5/beta-3/gamma-2
Ligand
BDBM50101422
Substrate
Meas. Tech.
ChEMBL_217645 (CHEMBL818517)
Ki
5500±n/a nM
Citation
 Primofiore, GSettimo, FDTaliani, SMarini, AMNovellino, EGreco, GLavecchia, ABesnard, FTrincavelli, LCosta, BMartini, C Novel N-(arylalkyl)indol-3-ylglyoxylylamides targeted as ligands of the benzodiazepine receptor: synthesis, biological evaluation, and molecular modeling analysis of the structure-activity relationships. J Med Chem 44:2286-97 (2001)  
Target
Name:
Gamma-aminobutyric acid receptor subunit alpha-5/beta-3/gamma-2
Synonyms:
GABA A receptor alpha-5/beta-3/gamma-2 | GABA receptor alpha-5/beta-3/gamma-2 subunit
Type:
Mol. Mass.:
Description:
ASSAY_ID of EBI is 70706
Components:
This complex has 3 components.
Component 1
Name:
Gamma-aminobutyric acid receptor subunit gamma-2
Synonyms:
GBRG2_RAT Gamma-aminobutyric acid receptor subunit gamma-2 (GABA(A) gamma-2)
Type:
Enzyme
Mol. Mass.:
54087.63
Organism:
Rattus norvegicus (Rat)
Description:
P18508
Residue:
466
  
Component 2
Name:
Gamma-aminobutyric acid receptor subunit alpha-5
Synonyms:
GABA A Alpha5Beta2Gamma2 GABA A Alpha5m10Beta2Gamma2 GABA A Alpha5m9Beta2Gamma2 GABA A receptor alpha-5/beta-3/gamma-2 GBRA5_RAT Gabra5 | Gamma-aminobutyric acid receptor subunit alpha-5
Type:
Enzyme Catalytic Domain
Mol. Mass.:
52350.79
Organism:
RAT
Description:
GABA A alpha5 0 RAT::P19969
Residue:
464
  
Component 3
Name:
Gamma-aminobutyric acid receptor subunit beta-3
Synonyms:
GABA receptor beta-3 subunit Gabrb-3 | Gabrb3
Type:
PROTEIN
Mol. Mass.:
54180.66
Organism:
Rattus norvegicus
Description:
EBI_12481
Residue:
473
  
Inhibitor
Name:
BDBM50101422
Synonyms:
(R)-2-(1H-indol-3-yl)-2-oxo-N-(1-phenylethyl)acetamide CHEMBL75406
Type:
Small organic molecule
Emp. Form.:
C18H16N2O2
Mol. Mass.:
292.3318
SMILES:
C[C@@H](NC(=O)C(=O)c1c[nH]c2ccccc12)c1ccccc1
: