Target
Phosphatidylcholine:ceramide cholinephosphotransferase 2
Ligand
BDBM50545116
Substrate
Meas. Tech.
ChEMBL_1994371 (CHEMBL4628266)
IC50
380±n/a nM
Citation
 Yukawa, TNakahata, TOkamoto, RIshichi, YMiyamoto, YNishimura, SOikawa, TKubo, KAdachi, RSatomi, YNakakariya, MAmano, NKamaura, MMatsunaga, N Discovery of 1,8-naphthyridin-2-one derivative as a potent and selective sphingomyelin synthase 2 inhibitor. Bioorg Med Chem 28:0 (2020)  
Target
Name:
Phosphatidylcholine:ceramide cholinephosphotransferase 2
Synonyms:
SGMS2 SMS2_HUMAN | Sphingomyelin synthase 2
Type:
PROTEIN
Mol. Mass.:
42294.80
Organism:
Homo sapiens (Human)
Description:
ChEMBL_108027
Residue:
365
  
Inhibitor
Name:
BDBM50545116
Synonyms:
CHEMBL4649105
Type:
Small organic molecule
Emp. Form.:
C30H26F6N2O4
Mol. Mass.:
592.5289
SMILES:
CN(Cc1cc(cc(c1)C(F)(F)F)C(F)(F)F)C(=O)c1c(OCCOCc2ccccc2)c2ccccc2n(C)c1=O
: