Target
Phosphatidylcholine:ceramide cholinephosphotransferase 2
Ligand
BDBM50545118
Substrate
Meas. Tech.
ChEMBL_1994371 (CHEMBL4628266)
IC50
350±n/a nM
Citation
 Yukawa, TNakahata, TOkamoto, RIshichi, YMiyamoto, YNishimura, SOikawa, TKubo, KAdachi, RSatomi, YNakakariya, MAmano, NKamaura, MMatsunaga, N Discovery of 1,8-naphthyridin-2-one derivative as a potent and selective sphingomyelin synthase 2 inhibitor. Bioorg Med Chem 28:0 (2020)  
Target
Name:
Phosphatidylcholine:ceramide cholinephosphotransferase 2
Synonyms:
SGMS2 SMS2_HUMAN | Sphingomyelin synthase 2
Type:
PROTEIN
Mol. Mass.:
42294.80
Organism:
Homo sapiens (Human)
Description:
ChEMBL_108027
Residue:
365
  
Inhibitor
Name:
BDBM50545118
Synonyms:
CHEMBL4637599
Type:
Small organic molecule
Emp. Form.:
C26H26F6N2O3
Mol. Mass.:
528.4867
SMILES:
CC(C)CCOc1c(C(=O)N(C)Cc2cc(cc(c2)C(F)(F)F)C(F)(F)F)c(=O)n(C)c2ccccc12
: