Target
Phosphatidylcholine:ceramide cholinephosphotransferase 2
Ligand
BDBM50545127
Substrate
Meas. Tech.
ChEMBL_1994371 (CHEMBL4628266)
IC50
300±n/a nM
Citation
 Yukawa, TNakahata, TOkamoto, RIshichi, YMiyamoto, YNishimura, SOikawa, TKubo, KAdachi, RSatomi, YNakakariya, MAmano, NKamaura, MMatsunaga, N Discovery of 1,8-naphthyridin-2-one derivative as a potent and selective sphingomyelin synthase 2 inhibitor. Bioorg Med Chem 28:0 (2020)  
Target
Name:
Phosphatidylcholine:ceramide cholinephosphotransferase 2
Synonyms:
SGMS2 SMS2_HUMAN | Sphingomyelin synthase 2
Type:
PROTEIN
Mol. Mass.:
42294.80
Organism:
Homo sapiens (Human)
Description:
ChEMBL_108027
Residue:
365
  
Inhibitor
Name:
BDBM50545127
Synonyms:
CHEMBL4644293
Type:
Small organic molecule
Emp. Form.:
C33H42N4O7
Mol. Mass.:
606.7092
SMILES:
COc1cc(CN(C)C(=O)c2c(OCCCC3CCN(CC3)C(=O)OC3(C)CC3)c3cccnc3n(C)c2=O)cc(OC)c1
: