Target
Sulfotransferase 1E1
Ligand
BDBM50102703
Substrate
Meas. Tech.
ChEMBL_67847 (CHEMBL681339)
IC50
>200000±n/a nM
Citation
 Verdugo, DECancilla, MTGe, XGray, NSChang, YTSchultz, PGNegishi, MLeary, JABertozzi, CR Discovery of estrogen sulfotransferase inhibitors from a purine library screen. J Med Chem 44:2683-6 (2001)  
Target
Name:
Sulfotransferase 1E1
Synonyms:
Est ST1E1_MOUSE Sult1e1
Type:
PROTEIN
Mol. Mass.:
35591.32
Organism:
Mus musculus
Description:
ChEMBL_67847
Residue:
295
  
Inhibitor
Name:
BDBM50102703
Synonyms:
2-{6-[Bis-(2-hydroxy-ethyl)-amino]-9-methyl-9H-purin-2-ylamino}-acetamide(YTC27) | CHEMBL92115
Type:
Small organic molecule
Emp. Form.:
C12H19N7O3
Mol. Mass.:
309.3244
SMILES:
Cn1cnc2c(nc(NCC(N)=O)nc12)N(CCO)CCO
: