Target
Alpha-1A/Alpha-1B/Alpha-1D adrenergic receptor
Ligand
BDBM50545276
Substrate
Meas. Tech.
ChEMBL_1994668 (CHEMBL4628563)
IC50
980±n/a nM
Citation
 Hansen, JDCorrea, MNagy, MAAlexander, MPlantevin, VGrant, VWhitefield, BHuang, DKercher, THarris, RNarla, RKLeisten, JTang, YMoghaddam, MEbinger, KPiccotti, JHavens, CGCathers, BCarmichael, JDaniel, TVessey, RHamann, LGLeftheris, KMendy, DBaculi, FLeBrun, LAKhambatta, GLopez-Girona, A Discovery of CRBN E3 Ligase Modulator CC-92480 for the Treatment of Relapsed and Refractory Multiple Myeloma. J Med Chem 63:6648-6676 (2020)  
Target
Name:
Alpha-1A/Alpha-1B/Alpha-1D adrenergic receptor
Synonyms:
Adrenergic receptor alpha-1
Type:
Mol. Mass.:
Description:
ASSAY_ID of ChEMBL is 306566
Components:
This complex has 3 components.
Component 1
Name:
Alpha-1D adrenergic receptor
Synonyms:
ADA1D_HUMAN ADRA1D Adrenergic receptor alpha Alpha 1D-adrenoreceptor Alpha-1D adrenoceptor adrenergic Alpha1D
Type:
Enzyme Catalytic Domain
Mol. Mass.:
60485.82
Organism:
Homo sapiens (Human)
Description:
adrenergic Alpha1D ADRA1D HUMAN::P25100
Residue:
572
  
Component 2
Name:
Alpha-1B adrenergic receptor
Synonyms:
ADA1B_HUMAN Adrenergic alpha1B Adrenergic receptor alpha Alpha 1B-adrenoreceptor | Alpha-1B adrenergic receptor
Type:
Enzyme
Mol. Mass.:
56862.13
Organism:
Homo sapiens (Human)
Description:
P35368
Residue:
520
  
Component 3
Name:
Alpha-1A adrenergic receptor
Synonyms:
ADA1A_HUMAN ADRA1C Alpha 1A-adrenoceptor Alpha adrenergic receptor 1a Alpha-adrenergic receptor 1c adrenergic Alpha1 | adrenergic Alpha1C
Type:
Cell-surface receptors
Mol. Mass.:
51511.67
Organism:
Homo sapiens (Human)
Description:
P35348
Residue:
466
  
Inhibitor
Name:
BDBM50545276
Synonyms:
CHEMBL4637801
Type:
Small organic molecule
Emp. Form.:
C32H30FN5O4
Mol. Mass.:
567.6101
SMILES:
Fc1cc(ccc1N1CCN(Cc2ccc(COc3cccc4C(=O)N(Cc34)C3CCC(=O)NC3=O)cc2)CC1)C#N
: