Target
Voltage-dependent N-type calcium channel subunit alpha-1B
Ligand
BDBM50451202
Substrate
Meas. Tech.
ChEBML_88713
IC50
3400±n/a nM
Citation
 Seko, TKato, MKohno, HOno, SHashimura, KTakimizu, HNakai, KMaegawa, HKatsube, NToda, M Structure-activity study and analgesic efficacy of amino acid derivatives as N-type calcium channel blockers. Bioorg Med Chem Lett 11:2067-70 (2001)  
Target
Name:
Voltage-dependent N-type calcium channel subunit alpha-1B
Synonyms:
BIII CAC1B_HUMAN CACNA1B Calcium channel (Type N) Voltage-dependent N-type calcium channel subunit alpha-1B Voltage-gated N-type calcium channel alpha-1B subunit Voltage-gated calcium channel Voltage-gated calcium channel subunit alpha Cav2.2 ((alpha 1B, beta 1b, alpha 2 delta-1) | calcium channel, voltage-dependent, N type, alpha 1B subunit
Type:
Enzyme
Mol. Mass.:
262548.16
Organism:
Homo sapiens (Human)
Description:
Q00975
Residue:
2339
  
Inhibitor
Name:
BDBM50451202
Synonyms:
CHEMBL302628
Type:
Small organic molecule
Emp. Form.:
C21H28BrNO6
Mol. Mass.:
470.354
SMILES:
CC(C)(C)OC(=O)N[C@@H](CC(=O)OC1CCCC1)C(=O)OCc1ccc(Br)cc1
: