Target
Tyrosine-protein kinase Yes
Ligand
BDBM50103780
Substrate
Meas. Tech.
ChEBML_217596
IC50
156000±n/a nM
Citation
 Kawahata, NYang, MGLuke, GPShakespeare, WCSundaramoorthi, RWang, YJohnson, DMerry, TViolette, SGuan, WBartlett, CSmith, JHatada, MLu, XDalgarno, DCEyermann, CJBohacek, RSSawyer, TK A novel phosphotyrosine mimetic 4'-carboxymethyloxy-3'-phosphonophenylalanine (Cpp): exploitation in the design of nonpeptide inhibitors of pp60(Src) SH2 domain. Bioorg Med Chem Lett 11:2319-23 (2001)  
Target
Name:
Tyrosine-protein kinase Yes
Synonyms:
Proto-oncogene c-Yes YES YES_HUMAN | p61-yes
Type:
Protein
Mol. Mass.:
60801.54
Organism:
Homo sapiens (Human)
Description:
P07947
Residue:
543
  
Inhibitor
Name:
BDBM50103780
Synonyms:
CHEMBL308734 | [4-{2-Acetylamino-2-[(S)-1-(3-carbamoyl-4-cyclohexylmethoxy-phenyl)-ethylcarbamoyl]-ethyl}-2-(ethoxy-hydroxy-phosphoryl)-phenoxy]-acetic acid
Type:
Small organic molecule
Emp. Form.:
C31H42N3O10P
Mol. Mass.:
647.653
SMILES:
CCOP(O)(=O)c1cc(CC(NC(C)=O)C(=O)N[C@@H](C)c2ccc(OCC3CCCCC3)c(c2)C(N)=O)ccc1OCC(O)=O
: