Target
Muscarinic acetylcholine receptor M5
Ligand
BDBM50546065
Substrate
Meas. Tech.
ChEMBL_2013875 (CHEMBL4667453)
EC50
>30000±n/a nM
Citation
 Engers, DWMelancon, BJGregro, ARBertron, JLBollinger, SRFelts, ASKonkol, LCWood, MRBollinger, KALuscombe, VBRodriguez, ALJones, CKBubser, MYohn, SEWood, MWBrandon, NJDugan, MENiswender, CMConn, PJBridges, TMLindsley, CW VU6005806/AZN-00016130, an advanced M Bioorg Med Chem Lett 29:1714-1718 (2019)  
Target
Name:
Muscarinic acetylcholine receptor M5
Synonyms:
ACM5_RAT Chrm-5 Muscarinic acetylcholine receptor | Muscarinic acetylcholine receptor M5
Type:
Enzyme Catalytic Domain
Mol. Mass.:
60161.80
Organism:
RAT
Description:
Cholinergic, muscarinic M5 CHRM5 RAT::P08911
Residue:
531
  
Inhibitor
Name:
BDBM50546065
Synonyms:
CHEMBL4795177
Type:
Small organic molecule
Emp. Form.:
C17H16F3N7O2S
Mol. Mass.:
439.415
SMILES:
COc1nnc2sc(C(=O)NC3CN(C3)c3ncc(cn3)C(F)(F)F)c(N)c2c1C
: