Target
Aldo-keto reductase family 1 member C3
Ligand
BDBM50237590
Substrate
Meas. Tech.
ChEMBL_2014947 (CHEMBL4668525)
IC50
850±n/a nM
Citation
 Liu, YHe, SChen, YLiu, YFeng, FLiu, WGuo, QZhao, LSun, H Overview of AKR1C3: Inhibitor Achievements and Disease Insights. J Med Chem 63:11305-11329 (2020)  
Target
Name:
Aldo-keto reductase family 1 member C3
Synonyms:
17-beta-Hydroxysteroid Dehydrogenase 5 (17-beta-HSD5, AKR1C3) AK1C3_HUMAN Aldo-keto reductase family 1 member C3 Aldo-keto reductase family 1 member C3 (AK1C3a) Aldo-keto-reductase family 1 member C3 Dihydrodiol dehydrogenase 3 Estradiol 17-beta-dehydrogenase KIAA0119 Prostaglandin F synthase Trans-1,2-dihydrobenzene-1,2-diol dehydrogenase
Type:
Enzyme
Mol. Mass.:
36859.86
Organism:
Homo sapiens (Human)
Description:
P42330
Residue:
323
  
Inhibitor
Name:
BDBM50237590
Synonyms:
Amaryl Glimepiride Niddaryl
Type:
Small organic molecule
Emp. Form.:
C24H34N4O5S
Mol. Mass.:
490.616
SMILES:
CCC1=C(C)CN(C(=O)NCCc2ccc(cc2)S(=O)(=O)NC(=O)N[C@H]2CC[C@H](C)CC2)C1=O
: