Target
Prostaglandin G/H synthase 1
Ligand
BDBM50105296
Substrate
Meas. Tech.
ChEBML_159271
IC50
>100000±n/a nM
Citation
 Feixas, JJiménez, JMGodessart, NPuig, CSoca, LCrespo, MI Naphthalene derivatives: A new series of selective cyclooxygenase-2 inhibitors. Bioorg Med Chem Lett 11:2687-90 (2001)  
Target
Name:
Prostaglandin G/H synthase 1
Synonyms:
Cox-1 Cyclooxygenase PGH1_RAT Ptgs1
Type:
Enzyme Catalytic Domain
Mol. Mass.:
69033.56
Organism:
RAT
Description:
COX-1 0 RAT::Q63921
Residue:
602
  
Inhibitor
Name:
BDBM50105296
Synonyms:
CHEMBL91595 | [4-(4-Chloro-benzyl)-7-methoxy-naphthalen-2-yl]-acetic acid
Type:
Small organic molecule
Emp. Form.:
C20H17ClO3
Mol. Mass.:
340.8
SMILES:
COc1ccc2c(Cc3ccc(Cl)cc3)cc(CC(O)=O)cc2c1
: