Target
Prostaglandin G/H synthase 2
Ligand
BDBM50105303
Substrate
Meas. Tech.
ChEBML_157858
IC50
520±n/a nM
Citation
 Feixas, JJiménez, JMGodessart, NPuig, CSoca, LCrespo, MI Naphthalene derivatives: A new series of selective cyclooxygenase-2 inhibitors. Bioorg Med Chem Lett 11:2687-90 (2001)  
Target
Name:
Prostaglandin G/H synthase 2
Synonyms:
Cox-2 Cyclooxygenase Ptgs2
Type:
Enzyme Catalytic Domain
Mol. Mass.:
69173.51
Organism:
RAT
Description:
COX-2 0 RAT::P35355
Residue:
604
  
Inhibitor
Name:
BDBM50105303
Synonyms:
2-[4-(4-Chloro-benzyl)-7-methoxy-naphthalen-1-yl]-propionic acid | CHEMBL90172
Type:
Small organic molecule
Emp. Form.:
C21H19ClO3
Mol. Mass.:
354.827
SMILES:
COc1ccc2c(Cc3ccc(Cl)cc3)ccc(C(C)C(O)=O)c2c1
: