Target
Prostaglandin G/H synthase 2
Ligand
BDBM22369
Substrate
Meas. Tech.
ChEBML_157858
IC50
760±n/a nM
Citation
 Feixas, JJiménez, JMGodessart, NPuig, CSoca, LCrespo, MI Naphthalene derivatives: A new series of selective cyclooxygenase-2 inhibitors. Bioorg Med Chem Lett 11:2687-90 (2001)  
Target
Name:
Prostaglandin G/H synthase 2
Synonyms:
Cox-2 Cyclooxygenase Ptgs2
Type:
Enzyme Catalytic Domain
Mol. Mass.:
69173.51
Organism:
RAT
Description:
COX-2 0 RAT::P35355
Residue:
604
  
Inhibitor
Name:
BDBM22369
Synonyms:
4-(4-methanesulfonylphenyl)-3-phenyl-2,5-dihydrofuran-2-one MK 0966 US11478464, Compound Rofecoxib | US11786535, Compound Rofecoxib
Type:
Small organic molecule
Emp. Form.:
C17H14O4S
Mol. Mass.:
314.356
SMILES:
CS(=O)(=O)c1ccc(cc1)C1=C(C(=O)OC1)c1ccccc1
: