Target
Prostaglandin G/H synthase 2
Ligand
BDBM50105300
Substrate
Meas. Tech.
ChEBML_157858
IC50
1700±n/a nM
Citation
 Feixas, JJiménez, JMGodessart, NPuig, CSoca, LCrespo, MI Naphthalene derivatives: A new series of selective cyclooxygenase-2 inhibitors. Bioorg Med Chem Lett 11:2687-90 (2001)  
Target
Name:
Prostaglandin G/H synthase 2
Synonyms:
Cox-2 Cyclooxygenase Ptgs2
Type:
Enzyme Catalytic Domain
Mol. Mass.:
69173.51
Organism:
RAT
Description:
COX-2 0 RAT::P35355
Residue:
604
  
Inhibitor
Name:
BDBM50105300
Synonyms:
2-[4-(4-Ethoxy-benzyl)-7-methoxy-naphthalen-1-yl]-propionic acid | CHEMBL92367
Type:
Small organic molecule
Emp. Form.:
C23H24O4
Mol. Mass.:
364.4343
SMILES:
CCOc1ccc(Cc2ccc(C(C)C(O)=O)c3cc(OC)ccc23)cc1
: