Target
Cytochrome P450 2C9
Ligand
BDBM50105822
Substrate
Meas. Tech.
ChEMBL_51545 (CHEMBL884338)
IC50
12000±n/a nM
Citation
 Ha-Duong, NTDijols, SMarques-Soares, CMinoletti, CDansette, PMMansuy, D Synthesis of sulfaphenazole derivatives and their use as inhibitors and tools for comparing the active sites of human liver cytochromes P450 of the 2C subfamily. J Med Chem 44:3622-31 (2001)  
Target
Name:
Cytochrome P450 2C9
Synonyms:
(R)-limonene 6-monooxygenase CP2C9_HUMAN CYP2C9 Cytochrome P450 2C9 (CYP2C9 ) P-450MP P450 PB-1 | S-mephenytoin 4-hydroxylase
Type:
Enzyme
Mol. Mass.:
55636.33
Organism:
Homo sapiens (Human)
Description:
P11712
Residue:
490
  
Inhibitor
Name:
BDBM50105822
Synonyms:
3'-Amino-biphenyl-4-sulfonic acid (2-phenyl-2H-pyrazol-3-yl)-amide | CHEMBL333108
Type:
Small organic molecule
Emp. Form.:
C21H18N4O2S
Mol. Mass.:
390.458
SMILES:
Nc1cccc(c1)-c1ccc(cc1)S(=O)(=O)Nc1ccnn1-c1ccccc1
: