Target
Cytochrome P450 2C8
Ligand
BDBM50105823
Substrate
Meas. Tech.
ChEMBL_51527 (CHEMBL660387)
IC50
15000±n/a nM
Citation
 Ha-Duong, NTDijols, SMarques-Soares, CMinoletti, CDansette, PMMansuy, D Synthesis of sulfaphenazole derivatives and their use as inhibitors and tools for comparing the active sites of human liver cytochromes P450 of the 2C subfamily. J Med Chem 44:3622-31 (2001)  
Target
Name:
Cytochrome P450 2C8
Synonyms:
CP2C8_HUMAN CYPIIC8 P450 IIC2 P450 form 1 | S-mephenytoin 4-hydroxylase
Type:
Protein
Mol. Mass.:
55839.23
Organism:
Homo sapiens (Human)
Description:
P10632
Residue:
490
  
Inhibitor
Name:
BDBM50105823
Synonyms:
4-Methyl-N-(2-phenyl-2H-pyrazol-3-yl)-N-propyl-benzenesulfonamide | CHEMBL121040
Type:
Small organic molecule
Emp. Form.:
C19H21N3O2S
Mol. Mass.:
355.454
SMILES:
CCCN(c1ccnn1-c1ccccc1)S(=O)(=O)c1ccc(C)cc1
: