Target
Endothelin-1 receptor
Ligand
BDBM50066391
Substrate
Meas. Tech.
ChEMBL_65639 (CHEMBL681521)
Ki
0.46±n/a nM
Citation
 Jae, HSWinn, Mvon Geldern, TWSorensen, BKChiou, WJNguyen, BMarsh, KCOpgenorth, TJ Pyrrolidine-3-carboxylic acids as endothelin antagonists. 5. Highly selective, potent, and orally active ET(A) antagonists. J Med Chem 44:3978-84 (2001)  
Target
Name:
Endothelin-1 receptor
Synonyms:
EDNRA ET-A ETA-R Endothelin receptor type A hET-AR
Type:
Enzyme Catalytic Domain
Mol. Mass.:
48736.88
Organism:
Homo sapiens (Human)
Description:
P25101
Residue:
427
  
Inhibitor
Name:
BDBM50066391
Synonyms:
(2S,3R,4S)-1-Dibutylcarbamoylmethyl-2-(2,2-dimethyl-pentyl)-4-(7-methoxy-benzo[1,3]dioxol-5-yl)-pyrrolidine-3-carboxylic acid CHEMBL111612
Type:
Small organic molecule
Emp. Form.:
C30H48N2O6
Mol. Mass.:
532.7119
SMILES:
CCCCN(CCCC)C(=O)CN1C[C@@H]([C@H]([C@@H]1CC(C)(C)CCC)C(O)=O)c1cc2OCOc2c(OC)c1
: