Target
Endothelin receptor type B
Ligand
BDBM50106404
Substrate
Meas. Tech.
ChEMBL_63864 (CHEMBL673048)
IC50
8130.0±n/a nM
Citation
 Jae, HSWinn, Mvon Geldern, TWSorensen, BKChiou, WJNguyen, BMarsh, KCOpgenorth, TJ Pyrrolidine-3-carboxylic acids as endothelin antagonists. 5. Highly selective, potent, and orally active ET(A) antagonists. J Med Chem 44:3978-84 (2001)  
Target
Name:
Endothelin receptor type B
Synonyms:
EDNRB ENDOTHELIN B ETRB Endothelin receptor non-selective type | Endothelin receptor, ET-A/ET-B
Type:
Enzyme Catalytic Domain
Mol. Mass.:
49664.00
Organism:
Homo sapiens (Human)
Description:
ENDOTHELIN B EDNRB HUMAN::P24530
Residue:
442
  
Inhibitor
Name:
BDBM50106404
Synonyms:
1-Dibutylcarbamoylmethyl-4-(2,3-dihydro-benzofuran-5-yl)-2-(4-ethyl-phenyl)-pyrrolidine-3-carboxylic acid | CHEMBL129740
Type:
Small organic molecule
Emp. Form.:
C31H42N2O4
Mol. Mass.:
506.6762
SMILES:
CCCCN(CCCC)C(=O)CN1C[C@@H]([C@H]([C@@H]1c1ccc(CC)cc1)C(O)=O)c1ccc2OCCc2c1
: