Target
ATPase family AAA domain-containing protein 2B
Ligand
BDBM50547690
Substrate
Meas. Tech.
ChEMBL_2018963 (CHEMBL4672541)
Kd
685300±n/a nM
Citation
 Lloyd, JTMcLaughlin, KLubula, MYGay, JCDest, AGao, CPhillips, MTonelli, MCornilescu, GMarunde, MREvans, CMBoyson, SPCarlson, SKeogh, MCMarkley, JLFrietze, SGlass, KC Structural Insights into the Recognition of Mono- and Diacetylated Histones by the ATAD2B Bromodomain. J Med Chem 63:12799-12813 (2020)  
Target
Name:
ATPase family AAA domain-containing protein 2B
Synonyms:
ATAD2B ATPase family AAA domain-containing protein 2B | KIAA1240
Type:
PROTEIN
Mol. Mass.:
164918.65
Organism:
Homo sapiens (Human)
Description:
ChEMBL_105350
Residue:
1458
  
Inhibitor
Name:
BDBM50547690
Synonyms:
CHEMBL4795500
Type:
Small organic molecule
Emp. Form.:
C54H97N21O18
Mol. Mass.:
1328.4779
SMILES:
CC(C)C[C@H](NC(=O)CNC(=O)[C@H](CCCCN)NC(=O)CNC(=O)CNC(=O)[C@H](CCCCN)NC(=O)CNC(=O)[C@H](CCCNC(N)=N)NC(=O)CNC(=O)[C@@H](N)CO)C(=O)NCC(=O)N[C@@H](CCCCNC(C)=O)C(=O)NCC(=O)NCC(=O)N[C@@H](C)C(O)=O
: