Target
Beta-3 adrenergic receptor
Ligand
BDBM50106801
Substrate
Meas. Tech.
ChEBML_39053
Ki
44±n/a nM
Citation
 Gavai, AVSher, PMMikkilineni, ABPoss, KMMcCann, PJGirotra, RNFisher, LGWu, GBednarz, MSMathur, AWang, TCSun, CQSlusarchyk, DASkwish, SAllen, GTHillyer, DEFrohlich, BHAbboa-Offei, BECap, MWaldron, TLGeorge, RJTesfamariam, BHarper, TWCiosek, CPYoung, DADickinson, KESeymour, AAArbeeny, CMWashburn, WN BMS-196085: a potent and selective full agonist of the human beta(3) adrenergic receptor. Bioorg Med Chem Lett 11:3041-4 (2001)  
Target
Name:
Beta-3 adrenergic receptor
Synonyms:
ADRB3 ADRB3_HUMAN Beta-2 adrenergic receptor and beta-3 adrenergic receptor Beta-3 adrenoreceptor | adrenergic Beta3
Type:
G Protein-Coupled Receptor (GPCR)
Mol. Mass.:
43534.88
Organism:
Homo sapiens (Human)
Description:
Residue:
408
  
Inhibitor
Name:
BDBM50106801
Synonyms:
CHEMBL102928 | N-(2-Hydroxy-5-{1-hydroxy-2-[1-(4-methoxy-phenyl)-2-phenyl-ethylamino]-ethyl}-phenyl)-methanesulfonamide
Type:
Small organic molecule
Emp. Form.:
C24H28N2O5S
Mol. Mass.:
456.555
SMILES:
COc1ccc(cc1)C(Cc1ccccc1)NCC(O)c1ccc(O)c(NS(C)(=O)=O)c1
: