Target
Beta-3 adrenergic receptor
Ligand
BDBM50106835
Substrate
Meas. Tech.
ChEBML_39053
Ki
26±n/a nM
Citation
 Gavai, AVSher, PMMikkilineni, ABPoss, KMMcCann, PJGirotra, RNFisher, LGWu, GBednarz, MSMathur, AWang, TCSun, CQSlusarchyk, DASkwish, SAllen, GTHillyer, DEFrohlich, BHAbboa-Offei, BECap, MWaldron, TLGeorge, RJTesfamariam, BHarper, TWCiosek, CPYoung, DADickinson, KESeymour, AAArbeeny, CMWashburn, WN BMS-196085: a potent and selective full agonist of the human beta(3) adrenergic receptor. Bioorg Med Chem Lett 11:3041-4 (2001)  
Target
Name:
Beta-3 adrenergic receptor
Synonyms:
ADRB3 ADRB3_HUMAN Beta-2 adrenergic receptor and beta-3 adrenergic receptor Beta-3 adrenoreceptor | adrenergic Beta3
Type:
G Protein-Coupled Receptor (GPCR)
Mol. Mass.:
43534.88
Organism:
Homo sapiens (Human)
Description:
Residue:
408
  
Inhibitor
Name:
BDBM50106835
Synonyms:
CHEMBL317920 | N-(2-Hydroxy-5-{(R)-1-hydroxy-2-[(R)-1-(4-methoxy-naphthalen-1-yl)-2-phenyl-ethylamino]-ethyl}-phenyl)-methanesulfonamide
Type:
Small organic molecule
Emp. Form.:
C28H30N2O5S
Mol. Mass.:
506.613
SMILES:
COc1ccc([C@@H](Cc2ccccc2)NC[C@H](O)c2ccc(O)c(NS(C)(=O)=O)c2)c2ccccc12
: