Target
Beta-3 adrenergic receptor
Ligand
BDBM50106844
Substrate
Meas. Tech.
ChEBML_39053
Ki
43±n/a nM
Citation
 Gavai, AVSher, PMMikkilineni, ABPoss, KMMcCann, PJGirotra, RNFisher, LGWu, GBednarz, MSMathur, AWang, TCSun, CQSlusarchyk, DASkwish, SAllen, GTHillyer, DEFrohlich, BHAbboa-Offei, BECap, MWaldron, TLGeorge, RJTesfamariam, BHarper, TWCiosek, CPYoung, DADickinson, KESeymour, AAArbeeny, CMWashburn, WN BMS-196085: a potent and selective full agonist of the human beta(3) adrenergic receptor. Bioorg Med Chem Lett 11:3041-4 (2001)  
Target
Name:
Beta-3 adrenergic receptor
Synonyms:
ADRB3 ADRB3_HUMAN Beta-2 adrenergic receptor and beta-3 adrenergic receptor Beta-3 adrenoreceptor | adrenergic Beta3
Type:
G Protein-Coupled Receptor (GPCR)
Mol. Mass.:
43534.88
Organism:
Homo sapiens (Human)
Description:
Residue:
408
  
Inhibitor
Name:
BDBM50106844
Synonyms:
CHEMBL431638 | N-{2-Hydroxy-5-[(R)-1-hydroxy-2-((R)-1-naphthalen-1-yl-2-phenyl-ethylamino)-ethyl]-phenyl}-methanesulfonamide
Type:
Small organic molecule
Emp. Form.:
C27H28N2O4S
Mol. Mass.:
476.587
SMILES:
CS(=O)(=O)Nc1cc(ccc1O)[C@@H](O)CN[C@H](Cc1ccccc1)c1cccc2ccccc12
: